Objetos
type: ConceptScheme
preferred label: Objectes @ca
preferred label: Objects @en

Librería consola
type: Concept
broader: Librería: muebles compuestos
definition: Librería de estantes, de un solo cuerpo, baja y escuadrada, de la altura del zócalo de la pared o la consola con un tablero superior en el que se pueden depositar objetos de adorno. A veces tienen una o dos puertas para guardar cosas o algún cajón. Incluso existen modelos con una pequeña zona para contener el bar.
definition: Llibreria de prestatges, d'un sol cos, baixa i escairada, de l'altura del sòcol de la paret o la consola amb un tauler superior en el qual es poden depositar objectes d'adorn. A vegades tenen una o dues portes per a guardar coses o algun calaix. Fins i tot existeixen models amb una xicoteta zona per a contindre el bar. @ca
definition: Bookcase with shelves made of a single-unit, low and squared, of the height of the wall plinth or console with a top board on which decorative objects can be placed. Sometimes they have one or two doors for storage or a drawer. There are even models with a small area to contain a small cabinet for a bar. @en
in scheme: Objetos
preferred label: Llibreria consola @ca

Librería: muebles compuestos
type: Concept
narrower: Librería consola
preferred label: Llibreria: mobles compostos @ca
preferred label: Bookcase: composite furniture @en