Objetos
type: ConceptScheme
preferred label: Objectes @ca
preferred label: Objects @en

Sofá cabriolé
type: Concept
alternative label: sofás cabriolé
alternative label: cabriole sofa @en
alternative label: cabriolé @ca
broader: Sofá
definition: Sofás de finales del siglo XVIII y principios del XIX con respaldo alto. Un tipo de sofá tapizado cuyo respaldo se curva hacia los brazos en una línea suave. El cabriolet era un tipo de carruaje -de ahí viene nuestra palabra "cab"- que tenía respaldos y brazos similares. Tienen una estructura de madera expuesta (a menudo tallada), secciones continuas de brazos y respaldo, patas inferiores cóncavas distintivas y sin cojines de respaldo separados. Los brazos y el respaldo del Cabriole son uno de sus rasgos más característicos. Prácticamente no hay diferencias de altura entre ellos, y ambos se redondean hacia el centro en la parte delantera.
definition: Sofàs de finals del segle XVIII i principis del XIX amb respatler alt. Un tipus de sofà entapissat el respatler del qual es corba cap als braços en una línia suau. El cabriolé era un tipus de carruatge -d'ací ve la nostra paraula "cab"- que tenia respatlers i braços similars. Tenen una estructura de fusta exposada (sovint tallada), seccions contínues de braços i respatler, potes inferiors còncaves distintives i sense coixins de respatler separats. Els braços i el respatler del Cabriole són un dels seus trets més característics. Pràcticament no hi ha diferències d'altura entre ells, i tots dos s'arredoneixen cap al centre en la part davantera. @ca
definition: Late 18th- and early 19th-century sofas having a high-pitch back. A type of upholstered sofa whose back curves into the arms in a smooth line. The cabriolet was a type of carriage--it's where our word "cab" comes from--that had similar backs and arms. They have an exposed wooden frame (often carved), continuous arm and back sections, distinctive concave lower legs, and no separate back cushions. The arms and back of the Cabriole are among its most distinctive features. There are virtually no differences in height between them, and they both round out towards the center at the front. @en
in scheme: Objetos
preferred label: Sofà cabriolé @ca
preferred label: Cabriolé sofas @en

Sofá
type: Concept
narrower: Sofá cabriolé
preferred label: Sofà @ca
preferred label: Sofa @en