Objetos
type: ConceptScheme
preferred label: Objectes @ca
preferred label: Objects @en

Diván
type: Concept
alternative label: Divan bed @en
broader: Mobiliario de asiento de varias plazas
definition: Del ár. clás. d?w?n, y este del pelvi d?w?n 'archivo'. Asiento alargado que se sustenta sobre una base maciza, a veces con pies poco apreciables. En algunos casos tiene brazos o respaldo, que se complementan con cojines y colchoncillos. Es mueble decimonónico.
definition: Del turc diwán, íd., i aquest, del persa dîwân tribunal, oficina; assemblea. Seient allargat que se sustenta sobre una base massissa, a vegades amb peus poc apreciables. En alguns casos té braços o respatler, que es complementen amb coixins. És moble huitcentista. @ca
definition: An elongated seat supported by a solid base, sometimes with feet that are not very noticeable. In some cases it has arms or a backrest, which are complemented with cushions and mattresses. It is nineteenth-century furniture. @en
in scheme: Objetos
narrower: Diván Barcelona
preferred label: Divan @ca

Mobiliario de asiento de varias plazas
type: Concept
narrower: Diván
preferred label: Mobiliari de seient de diverses places @ca
preferred label: Multi-seat furniture @en

Diván Barcelona
type: Concept
broader: Diván
preferred label: Divan Barcelona @ca
preferred label: Barcelona divan @en