Objetos
type: ConceptScheme
preferred label: Objectes @ca
preferred label: Objects @en

Silla de teatro
type: Concept
broader: Silla por función
definition: Silla del s. XIX que se ubicaba en el palco del teatro y que se caracteriza por tener patas altas.
definition: cadira del s. XIX que es situava en la llotja del teatre i que es caracteritza per tindre potes altes. @ca
definition: 19th-century chair that was located in the theatre box and is characterised by its high legs. @en
in scheme: Objetos
preferred label: Cadira de teatre @ca
preferred label: Theatre chair @en

Silla por función
type: Concept
narrower: Silla de teatro
preferred label: Cadira per funció @ca
preferred label: Chairs by function @en