Objects
type: ConceptScheme
preferred label: Objetos @es
preferred label: Objectes @ca

Living room seating
type: Concept
broader: Set of chairs
definition: Sillería para sala compuesta por un canapé, sillones y sillas. @es
definition: Living seating, consisting of a sofa, armchairs and chairs.
definition: Cadirat per a sala composta per un canapè, butaques i cadires.
in scheme: Objects
preferred label: Sillería de salón @es
preferred label: Cadirat de saló @ca

Set of chairs
type: Concept
narrower: Living room seating
preferred label: Sillería @es
preferred label: Cadirat @ca