Actividades
type: ConceptScheme
preferred label: Activitats @ca
preferred label: Activities @en

DM
type: Concept
alternative label: Tablero DM
alternative label: Tauler DM @ca
broader: Aglomerado
definition: Tableros de densidades medias (entre 720 y 770 kg/m³) porosos, muy higroscópicos, y semejantes al cartón grueso, compuestos por fibras muy desfiguradas fijadas mediante cola, agua y mordientes.
definition: Taulers de densitats mitjanes (entre 720 i 770 kg/m³) porosos, molt higroscòpics, i semblants al cartó gruixut, composts per fibres molt desfigurades fixades mitjançant cola, aigua i mordents. @ca
definition: Medium density fibreboards (between 720 and 770 kg/m³) porous, very hygroscopic, and similar to thick cardboard, made up of highly disfigured fibres fixed by glue, water and mordants. @en
in scheme: Actividades
preferred label: MD Fibreboard @en

Aglomerado
type: Concept
narrower: DM
preferred label: Aglomerat @ca
preferred label: Agglomeration @en