Actividades
type: ConceptScheme
preferred label: Activitats @ca
preferred label: Activities @en

Sopiado de vidrio
type: Concept
broader: Procesos y técnicas del vidrio
definition: Proceso de dar forma al vidrio soplando aire a través de un tubo de soplado dentro de un globo de vidrio fundido.
definition: Procés de donar forma al vidre bufant aire a través d'un tub de bufat dins d'un globus de vidre fos. @ca
definition: The process of shaping glass by blowing air through a blowpipe into a glob of molten glass and forming it with tongs and shears or by rolling it against a hard surface. @en
in scheme: Actividades
preferred label: Bufat de vidre @ca
preferred label: Glassblowing @en

Procesos y técnicas del vidrio
type: Concept
narrower: Sopiado de vidrio
preferred label: Processos i tècniques de vidre @ca
preferred label: Glass working techniques and processes @en