Actividades
type: ConceptScheme
preferred label: Activitats @ca
preferred label: Activities @en

Engrapado
type: Concept
alternative label: grapado
broader: Unión
definition: Asegurar, enlazar o unir con grapas
definition: Assegurar, enllaçar o unir amb grapes. @ca
definition: The action of securing or fastening with the use of staples. @en
in scheme: Actividades
preferred label: Grapat @ca
preferred label: Stapling @en

Unión
type: Concept
narrower: Engrapado
preferred label: Unió @ca
preferred label: Join @en