Actividades
type: ConceptScheme
preferred label: Activitats @ca
preferred label: Activities @en

Estarcido
type: Concept
broader: Procesos y técnicas de transferencia
definition: Técnica de reporte y de decoración pictórica en la que se emplea una plantilla que lleva el dibujo o diseño a trasladar a otra superficie. El contorno del diseño se perfora o se recorta el contorno y, a continuación, la plantilla se pone en la zona a decorar y se le aplica una sustancia colorante (en polvo, pasta o forma líquida) por el anverso. El estarcido realizado mediante la perforación del contorno de un dibujo es una de las técnicas de reporte más empleadas en el dibujo y en la pintura.
definition: Tècnica de reporte i de decoració pictòrica en la qual s'empra una plantilla que porta el dibuix o disseny a traslladar a una altra superfície. El contorn del disseny es perfora o es retalla el contorn i, a continuació, la plantilla es posa en la zona a decorar i se li aplica una substància colorant (en pols, pasta o forma líquida) per l'anvers. L'estergit realitzat mitjançant la perforació del contorn d'un dibuix és una de les tècniques de reporte més emprades en el dibuix i en la pintura. @ca
definition: A technique of reporting and pictorial decoration in which a stencil is used which carries the drawing or design to be transferred to another surface. The outline of the design is perforated or the outline is cut out and then the stencil is placed on the area to be decorated and a colouring substance (in powder, paste or liquid form) is applied to the front of the stencil. Stencilling by perforating the outline of a drawing is one of the most common techniques used in drawing and painting. @en
in scheme: Actividades
preferred label: Estergit @ca
preferred label: Pouncing @en

Procesos y técnicas de transferencia
type: Concept
narrower: Estarcido
preferred label: Processos i tècniques de transferència @en