Objetos
type: ConceptScheme
preferred label: Objectes @ca
preferred label: Objects @en

Silla de lona
type: Concept
broader: Silla por forma
definition: Silla o asiento formado por un respaldo de sábana de lona, cuero u otro material textil que provoca que cuelgue sobre un bastidor o estructura.
definition: Silla o seient format per un respatller de llençol de lona, cuior o un altre material tèxtil que provoca que penge sobre un bastidor o estructura. @ca
definition: A chair or seat with a fabric back made of canvas, leather or other textile material that is suspended from a frame or structure. @en
in scheme: Objetos
preferred label: Cadira de lona @ca
preferred label: Sling chair @en

Silla por forma
type: Concept
narrower: Silla de lona
preferred label: Cadira per forma @ca
preferred label: Chairs by form @en