Objetos
type: ConceptScheme
preferred label: Objectes @ca
preferred label: Objects @en

Cuna (cama infantil)
type: Concept
broader: Mobiliario infantil
definition: Cama pequeña infantil con laterales cerrados.
definition: Llit xicotet infantil amb laterals tancats. @ca
definition: Small children's bed with closed sides. @en
in scheme: Objetos
preferred label: Bressol (llit infantil) @ca
preferred label: Crib @en

Mobiliario infantil
type: Concept
narrower: Cuna (cama infantil)
preferred label: Mobiliari infantil @ca
preferred label: Children's furnishing @en