Actividades
type: ConceptScheme
preferred label: Activitats @ca
preferred label: Activities @en

Adhesión
type: Concept
broader: Procesos y técnicas de unión y adhesión
definition: Del lat. adhaesio, -?nis. La unión de dos superficies por medio de una composición generalmente viscosa y pegajosa, tal como un adhesivo, o a través de una fuerza física o química.
definition: del ll. adhaesio, -?nis. La unió de dues superfícies per mitjà d'una composició generalment viscosa i enganxosa, tal com un adhesiu, o a través d'una força física o química. @ca
definition: n. from Latin adhaesi?n- a sticking. The joining of two surfaces by means of a generally viscous, sticky composition such as an adhesive or through physical or chemical force. @en
in scheme: Actividades
narrower: Pegado
preferred label: Adhesió @ca
preferred label: Adhesion @en

Procesos y técnicas de unión y adhesión
type: Concept
narrower: Adhesión
preferred label: Processos i tècniques d'unió i adhesió @ca
preferred label: Additive and joining processes and techniques @en

Pegado
type: Concept
broader: Adhesión
preferred label: Pegat @ca
preferred label: Gluing @en