Objetos
type: ConceptScheme
preferred label: Objectes @ca
preferred label: Objects @en

Estante
type: Concept
alternative label: balda
alternative label: estant @ca
alternative label: shelves @en
broader: Componentes del mobiliario
definition: De estar y -nte; lat. stans, -antis. Cada una de las tablas dispuestas horizontalmente en un mueble o en la pared para colocar objetos sobre ellas. Puede ser de varios materiales rígidos y sirve para poner objetos o libros sobre ellos. De tamaños muy variados, pueden descansar sobre el suelo, o pueden suspenderse de la pared, también los hay empotrados en el muro. A veces llevan barandillas a modo de tope.
definition: Del ll. td. parastat?cum, i aquest, del gr. parastatikós destinat a exposar. Cadascuna de les taules disposades horitzontalment en un moble o en la paret per a col·locar objectes sobre elles. Pot ser de diversos materials rígids i serveix per a posar objectes o llibres sobre ells. De grandàries molt variades, poden descansar sobre el sòl, o poden suspendre's de la paret, també n'hi ha encastats en el mur. A vegades porten baranes. @ca
definition: n. Middle English, probably from Old English scylfe; akin to Old Norse hl?thskjalf Odin's seat. Boards, planks, or slabs of wood or any other rigid material fixed in a horizontal position to a wall or in a case, to hold books or other objects as in a bookcase or cabinet. They come in a wide variety of sizes and types: they can rest on the floor, or they can be suspended from the wall, or be built into the wall. Sometimes they have railings to act as a stopper. @en
in scheme: Objetos
preferred label: Prestatge @ca
preferred label: Shelf @en

Componentes del mobiliario
type: Concept
narrower: Estante
preferred label: Components del mobiliari @ca
preferred label: Furnishings components @en