Objetos
type: ConceptScheme
preferred label: Objectes @ca
preferred label: Objects @en

Silla de Granada
type: Concept
broader: Silla de caderas
definition: Silla de cadera adornada mediante taracea. Emplea habitualmente motivos de tipo geométrico y fueron realizadas principalmente por talleres granadinos (antes y después de la conquista). Su éxito se dio en la zona de Castilla (s. XV y XVI) donde así las denominan. En el último cuarto del s. XIX y en el s. XX han sido reinterpretadas y copiadas.
definition: cadira de maluc adornat mitjançant taracea. Empra habitualment motius de tipus geomètric i van ser realitzades principalment per tallers granadins (abans i després de la conquesta). El seu èxit es va donar en la zona de Castella (s. XV i XVI) on així les denominen. En l'últim quart del s. XIX i en el s. XX han sigut reinterpretades i copiades. @ca
definition: Hip chair decorated with inlaid work. It usually uses geometric patterns and was made mainly by workshops in Granada (before and after the conquest). They are known as such because of their success in the Castilian region (15th and 16th centuries). They were reinterpreted and copied in the last quarter of the 19th and 20th centuries. @en
in scheme: Objetos
preferred label: Cadira de Granada @ca
preferred label: Granada chair @en

Silla de caderas
type: Concept
narrower: Silla de Granada
preferred label: Silla de maluc @ca
preferred label: X-chair @en