Activitats
type: ConceptScheme
preferred label: Actividades @es
preferred label: Activities @en

Clivellat
type: Concept
alternative label: Clivellatge
alternative label: crackleware @en
broader: Acabat
definition: Técnica de agrietamiento de una superficie (de un cuadro, un retablo, una porcelana, etc.) usada como procedimiento decorativo. @es
definition: Tècnica d'esquerdament d'una superfície (de un quadre, un retaule, una porcellana, etc.) utilitzada com a procediment decoratiu.
definition: Surface cracking technique (of a painting, altarpiece, porcelain, etc.) used as a decorative process. @en
in scheme: Activitats
preferred label: Craquelado @es
preferred label: Crackle @en

Acabat
type: Concept
narrower: Clivellat
preferred label: Acabado @es
preferred label: Finish @en