Objetos
type: ConceptScheme
preferred label: Objectes @ca
preferred label: Objects @en

Mesa de exterior de bar
type: Concept
broader: Mesa de exterior
definition: Mesa de exterior para estar en la terraza de un establecimiento de restauración como un bar, una cafetería, restaurante... Se caracterizan por sus materiales duraderos y por hacer juego, generalmente, con el resto del mobiliario.
definition: Taula d'exterior per a ser a la terrassa d'un establiment de restauració com un bar, una cafeteria, restaurant... Es caracteritzen pels seus materials duradors i per fer joc, generalment, amb la resta del mobiliari. @ca
definition: Outdoor table to be placed on the terrace of a catering establishment such as a bar, café, restaurant... They are characterised by their durable materials and generally match the rest of the furniture @en
in scheme: Objetos
preferred label: Taula d'exterior de bar @ca
preferred label: Outdoor bar table @en

Mesa de exterior
type: Concept
narrower: Mesa de exterior de bar
preferred label: Taula d'exterior @ca