Objetos
type: ConceptScheme
preferred label: Objectes @ca
preferred label: Objects @en

Escabel
type: Concept
alternative label: alzapiés
broader: Mobiliario de asiento individual sin respaldo
definition: Quizá del cat. ant. escabell, y este del lat. scabellum. Reposapiés de un asiento o mueble exento que sirve para apoyar los piés.
definition: Del ll. scabellum, íd., diminutiu de scamnum banc, escon; la -m- del cat. prové daquest mot i duna altra variant del dimin. scamellum. Tamboret de poca alçada que serveix per a posar-hi els peus quan hom està assegut, o per a pujar-hi de peus. @ca
definition: Small, low stools, to support one's feet. @en
in scheme: Objetos
preferred label: Escambell @ca
preferred label: Footstool @en

Mobiliario de asiento individual sin respaldo
type: Concept
narrower: Escabel
preferred label: Mobiliari de seient individual sense respatler @ca
preferred label: Individual seating furniture without backrest @en