Objetos
type: ConceptScheme
preferred label: Objectes @ca
preferred label: Objects @en

Sillón de terraza
type: Concept
broader: Sillón por forma
definition: Sillón generalmente usado en las terrazas o espacios abiertos. Muchas veces diseñados para la restauración y concretamente para exteriores.
definition: Butaca generalment usada a les terrasses o espais oberts. Moltes vegades dissenyats per a la restauració i concretament per a exteriors. @ca
in scheme: Objetos
preferred label: Butaca de terrassa @ca

Sillón por forma
type: Concept
narrower: Sillón de terraza
preferred label: Butaca per forma @ca
preferred label: Armchairs by form @en