Objects
type: ConceptScheme
preferred label: Objetos @es
preferred label: Objectes @ca

Knapsack
type: Concept
alternative label: Backpack
broader: Containers for personal use
definition: De mochil. Bolsa de lona, nailon, cuero u otro material flexible, usadas en la espalda por medio de una correa sobre cada hombro. @es
definition: Borsa de lona, niló, cuir o un altre material flexible, usades a l'esquena per mitjà d'una corretja sobre cada muscle. @ca
definition: Bags of canvas, nylon, leather, or other flexible material worn on the back by means of a strap over each shoulder.
in scheme: Objects
preferred label: Mochila @es
preferred label: Motxilla @ca

Containers for personal use
type: Concept
narrower: Knapsack
preferred label: Contenedores de uso personal @es
preferred label: Contenidors d'ús personal @ca