Objetos
type: ConceptScheme
preferred label: Objectes @ca
preferred label: Objects @en

Tête-a-tête
type: Concept
broader: Canapé
definition: Un sofá con una curva cóncava en el respaldo o un soporte horizontal en el centro que resalta los dos lados (del respaldo). Generalmente es un medio sofá, del tipo góndola. Para el mobiliario inglés, tête a tête es sinónimo de vis a vis.
definition: Un sofà amb una corba còncava en el suport o un suport horitzontal en el centre que ressalta els dos costats (del suport). Generalment és un mig sofà, del tipus góndola. Per a la literatura específica anglesa tête a tête és sinònim de vis-a-vis. @ca
definition: A sofa with a concave curve in the backrest or a horizontal support in the centre that highlights the two sides (of the backrest). It is usually a half sofa, of the gondola type. For English furniture, the term tête-à-tête is a synonym of vis-a-vis @en
in scheme: Objetos

Canapé
type: Concept
narrower: Tête-a-tête
preferred label: Canapè @ca