Actividades
type: ConceptScheme
preferred label: Activitats @ca
preferred label: Activities @en

Pegado
type: Concept
broader: Adhesión
definition: Del part. de pegar. Acción de unir o sujetar con una sustancia adhesiva viscosa o pegajosa.
definition: De pegar. Acció d'unir o subjectar amb una substància adhesiva viscosa o enganxosa. @ca
definition: The action of joining or fastening with an adhesive viscous or sticky substance. @en
in scheme: Actividades
narrower: Encolado (adherir)
preferred label: Pegat @ca
preferred label: Gluing @en

Adhesión
type: Concept
narrower: Pegado
preferred label: Adhesió @ca
preferred label: Adhesion @en

Encolado (adherir)
type: Concept
broader: Pegado
preferred label: Encolat @ca
preferred label: Sizing @en