Objetos
type: ConceptScheme
preferred label: Objectes @ca
preferred label: Objects @en

Mesilla de noche
type: Concept
alternative label: mesita de noche
broader: Mesa por función
definition: Mesa pequeña que se coloca junto a la cama. Suele servir como soporte de la luz y, anteriormente para tener el bacín junto a la cama. Algunas tienen cajones y pueden tener diferentes formas como cuadradas, con rinconera y cilíndricas.
definition: Mesa xicoteta que es col·loca al costat del llit. Sol servir com a suport de la llum i, anteriorment per a tindre el orinal al costat del llit. Algunes tenen calaixos i poden tindre diferents formes com a quadrades, amb raconera i cilíndriques. @ca
definition: Small table that is placed next to the bed. It is often used to support the light and, previously, to keep the bedside table next to the bed. Some have drawers and can have different shapes such as square, corner and cylindrical. @en
in scheme: Objetos
preferred label: Tauleta de nit @ca
preferred label: Bedside table @en

Mesa por función
type: Concept
narrower: Mesilla de noche
preferred label: Taula per funció @ca
preferred label: Table by function @en