Objectes
type: ConceptScheme
preferred label: Objetos @es
preferred label: Objects @en

Espill
type: Concept
alternative label: Mirall
broader: Mobiliari per forma i funció
definition: Del lat. spec?lum. Objeto con una superficie muy pulida, diseñado para reflejar imágenes con claridad. La superficie suele ser lisa y plana o, algunas veces, ligeramente curvada. En la Antigüedad y Edad Media estaba hecho de metal pulido; posteriormente, una placa de cristal azogado por la parte posterior, aunque también los hay de acero u otro material bruñido, para que se reflejen en él los objetos que tenga delante. @es
definition: Del ll. sp?c?lum, íd., der. del ll. sp?c?re mirar 1a font: s. XIII, Cerverí. Superfície llisa i molt reflectora que, per reflexió dels raigs de llum, dona imatges clares dels objectes.
definition: A surface, such as polished metal or glass coated with a metal film, that reflects light without diffusion and produces an image of an object placed in front of it. @en
in scheme: Objectes
narrower: Espill d'estil venecià
preferred label: Espejo @es
preferred label: Mirror @en

Mobiliari per forma i funció
type: Concept
narrower: Espill
preferred label: Mobiliario por forma y función @es
preferred label: Furnishings by form or function @en

Espill d'estil venecià
type: Concept
broader: Espill
preferred label: Espejo estilo veneciano @es
preferred label: Venetian-style mirror @en