Objetos
type: ConceptScheme
preferred label: Objectes @ca
preferred label: Objects @en

Marco
type: Concept
broader: Elementos de arquitectura
definition: Del germ. *mark; cf. nórd. mark, a. al. ant. marka. Bastidor de madera que enmarca un panel u hoja de madera, o de otro material: puerta, ventana, espejo, trabajos artísticos bidimensionales o en relieve, etc.
definition: Bastidor de fusta que emmarca un panell o fulla de fusta, o d'un altre material: porta, finestra, espill, treballs artístics bidimensionals o en relleu, etc. @ca
definition: Wooden frame that frames a panel or sheet of wood or other material: door, window, mirror, two-dimensional or relief artwork, etc. @en
in scheme: Objetos
preferred label: Marc (arquitectònic) @ca
preferred label: Frame @en

Elementos de arquitectura
type: Concept
narrower: Marco
preferred label: Elements d'arquitectura @ca
preferred label: Architectural elements @en