Objetos
type: ConceptScheme
preferred label: Objectes @ca
preferred label: Objects @en

Sillón club
type: Concept
broader: Sillón por forma
definition: El sillón de Josef Albers está inspirado en los sillones club. Su estructura visible la forman dos cuadrados de cantos redondeados, hechos en madera de arce y contrachapado de nogal. Este esqueleto le proporcionaba un aspecto ligero, a la vez el cojín de pluma lo hacía sumamente cómodo. El sillón fue diseñado en 1926 para Hans Ludwig. Su diseño recuerda a la serie Homenaje al cuadrado, plasmando la abstracción en un mueble tan corriente como un sillón. A pesar de que no sigue en producción como las famosas sillas tubulares de Marcel Breuer sus formas nos recuerdan a la silla Wassily que diseñara Breuer en 1926.
definition: La butaca de Josef Albers està inspirat en les butaques club. La seua estructura visible la formen dos quadrats de cants arredonits, fets en fusta d'auró i contraxapat de noguera. Aquest esquelet li proporcionava un aspecte lleuger, alhora el coixí de ploma el feia summament còmode. La butaca va ser dissenyada en 1926 per a Hans Ludwig. El seu disseny recorda a la sèrie Homenatge al quadrat, plasmant l'abstracció en un moble tan corrent com una butaca. A pesar que no segueix en producció com les famoses cadires tubulars de Marcel Breuer les seues formes ens recorden a la cadira Wassily que dissenyara Breuer en 1926. @ca
definition: Josef Albers' armchair was inspired by club armchairs. Its visible structure is formed by two squares with rounded edges, made of maple wood and walnut plywood. This skeleton gave it a light appearance, while the feather cushion made it extremely comfortable. The armchair was designed in 1926 for Hans Ludwig. Its design is reminiscent of the Homage to the Square series, which embodies abstraction in a piece of furniture as ordinary as an armchair. Although it is no longer in production like Marcel Breuer's famous tubular chairs, its forms remind us of the Wassily chair designed by Breuer in 1926. @en
in scheme: Objetos
preferred label: Butaca club @ca
preferred label: Club armchair @en

Sillón por forma
type: Concept
narrower: Sillón club
preferred label: Butaca per forma @ca
preferred label: Armchairs by form @en