Objetos
type: ConceptScheme
preferred label: Objectes @ca
preferred label: Objects @en

Pasamanería
type: Concept
broader: Diseño industrial
definition: De pasamanero e -ía. Denominación genérica que abarca los galones, trencillas, cordones, franjas, etc., ya sean de oro, plata, seda, lino, algodón o lana, y que se utilicen parar guarnecer y adornar vestidos, cortinas, tapicerías, muebles, etc. También tomaban esta denominación los bordados que se utilizaban para guarnecer las bocamangas de los vestidos.
definition: de passamaner. Denominació genèrica que abasta els galons, trenetes, cordons, franges, etc., ja siguen d'or, plata, seda, lli, cotó o llana, i que s'utilitzen per a guarnir i adornar vestits, cortines, tapisseries, mobles, etc. També prenien aquesta denominació els brodats que s'utilitzaven per a guarnir les bocamànigues dels vestits. @ca
definition: n. A termn borrowed from the Frenc "passementerie". It refers to the elaborately and decorative and often sumptuous trimming consisting of braids, tassels, gimps, etc., variously made from silk, linen, wool, cotton, and silver and gold thread, etc., popularized by French designs in the 17th cent. @en
in scheme: Objetos
narrower: Fleco
narrower: Cinta
narrower: Galón
preferred label: Passamaneria @ca
preferred label: Passementerie @en

Diseño industrial
type: Concept
narrower: Pasamanería
preferred label: Disseny industrial @ca
preferred label: Industrial design @en

Fleco
type: Concept
broader: Pasamanería
preferred label: Floc @ca
preferred label: Fringe @en

Cinta
type: Concept
broader: Pasamanería
preferred label: Ribbon @en

Galón
type: Concept
broader: Pasamanería
preferred label: Galó @ca
preferred label: Braid @en