Objetos
type: ConceptScheme
preferred label: Objectes @ca
preferred label: Objects @en

Piecero
type: Concept
broader: Componentes de cama
definition: De pie y la t. de cabecero. Pieza o estructura de la cama opuesta al cabecero que cierra una cama en el lado corto de los pies.
definition: Del ll. p?s, p?dis, íd. Peça o estructura del llit oposat al capçal que tanca un llit en el costat curt dels peus. @ca
definition: A piece or bed frame opposite the headboard that encloses a bed on the short side of the footboard. @en
in scheme: Objetos
preferred label: Peu de llit @ca
preferred label: Footboard @en

Componentes de cama
type: Concept
narrower: Piecero
preferred label: Components de llit @ca
preferred label: Bed components @en