Objetos
type: ConceptScheme
preferred label: Objectes @ca
preferred label: Objects @en

Bingo
type: Concept
broader: Juego de mesa y tablero
definition: Del ingl. bingo. Juego de azar que usa tarjetas en las que hay una rejilla impresa de números, una hilera que constituye una victoria cuando se han elegido al azar. Los números elegidos, generalmente hasta 75 o 90, son llamados por un "banquero", y el primer jugador en conseguir una tarjeta o una línea en la que todos los números han sido gritado "bingo" o "caja", y recoge todo el dinero de la apuesta, por lo general menos de un porcentaje especificado, lo que está permitido por la ley local. Otras variaciones juega una carta en la que la plaza central es libre, y el primer jugador en cuya tarjeta de cinco de los llamados números aparecen en una fila, vertical, horizontal o diagonal, será el ganador.
definition: Joc d'atzar que usa targetes en les quals hi ha una reixeta impresa de números, una filera que constituïx una victòria quan s'han triat a l'atzar. Els números triats, generalment fins a 75 o 90, són cridats per un "banquer", i el primer jugador a aconseguir una targeta o una línia en la qual tots els números han sigut cridat "bingo" o "caixa", i arreplega tots els diners de l'aposta, en general menys d'un percentatge especificat, la qual cosa està permés per la llei local. Altres variacions juga una carta en la qual la plaça central és lliure, i el primer jugador en la targeta del qual de cinc dels anomenats números apareixen en una fila, vertical, horitzontal o diagonal, serà el guanyador. @ca
definition: Game of chance using cards on which there is a printed grid of numbers, a row of which constitute a win when they have been chosen at random. The chosen numbers, usually up to 75 or 90, are called out by a "banker," and the first player to achieve a card or a line in which all of the numbers have been called shouts "bingo" or "house," and collects the entire stake money, usually less a specified percentage, whatever is permitted by local law. Other variations play a card in which the central square is free, and the first player on whose card five of the called numbers appear in a row, vertically, horizontally, or diagonally, is the winner. @en
in scheme: Objetos

Juego de mesa y tablero
type: Concept
narrower: Bingo
preferred label: Joc de taula i tauler @ca