Objetos
type: ConceptScheme
preferred label: Objectes @ca
preferred label: Objects @en

Lámpara de escritorio
type: Concept
alternative label: làmpada d'escriptori @en
broader: Lámpara por forma
definition: Lámparas diseñadas para ser usadas sobre un escritorio, normalmente tienen algunos medios para regular la fuente de luz.
definition: Lamps designed to be used on a desk, usually have some means of dimming the light source. @ca
definition: Lamps designed to be used on a desk, usually having some means of adjusting the light source. @en
in scheme: Objetos
narrower: Flexo
preferred label: Làmpara d'escriptori @ca

Lámpara por forma
type: Concept
narrower: Lámpara de escritorio
preferred label: Làmpada per forma @ca
preferred label: Lamps by form @en

Flexo
type: Concept
broader: Lámpara de escritorio
preferred label: Architects' lamp @en