Objetos
type: ConceptScheme
preferred label: Objectes @ca
preferred label: Objects @en

Chapera
type: Concept
broader: Componentes del mobiliario
definition: De chapa. Pieza de madera cubierta de tela o tallada que remata los frentes y brazos de los sofás tapizados.
definition: Peça de fusta coberta de tela o tallada que remata els fronts i braços dels sofàs entapissats @ca
definition: Piece of wood covered with fabric or carved to finish off the fronts and arms of upholstered sofas. @en
in scheme: Objetos

Componentes del mobiliario
type: Concept
narrower: Chapera
preferred label: Components del mobiliari @ca
preferred label: Furnishings components @en