Objetos
type: ConceptScheme
preferred label: Objectes @ca
preferred label: Objects @en

Hamaca
type: Concept
broader: Asientos cama
definition: Del taíno hamaca. Asiento o cama mecedora consistente en una armadura graduable, generalmente de tijera, en la que se sujeta una tela que forma el asiento y el respaldo, cuya altura es regulable, en general mediante un sistema de cremallera.
definition: Del cast. hamaca, íd., del taïno de Santo Domingo, a les Antilles. Seient o llit balancí consistent en una armadura graduable, generalment de tisora, en la qual se subjecta una tela que forma el seient i el respatler, l'altura del qual és regulable, en general mitjançant un sistema de cremallera. @ca
definition: n. from Spanish hamaca, of Taino origin. A seat or rocking bed consisting of an adjustable frame, usually scissors-like, to which a fabric is attached to form the seat and backrest. The height is adjustable, usually by means of a zip system. @en
in scheme: Objetos
preferred label: Hammock @en

Asientos cama
type: Concept
narrower: Hamaca