Objetos
type: ConceptScheme
preferred label: Objectes @ca
preferred label: Objects @en

Orinal
type: Concept
alternative label: basseta @ca
broader: Contenedores para el cuidado de la salud
definition: cas. Del lat. ur?nal, -?lis. Recipiente doméstico para los orines. Los hay de retrete, de cama y de viaje.
definition: Del b. ll. urinal, íd. 1a font: s. XIV. Recipient domèstic per als orines. N'hi ha d'excusat, de llit i de viatge. @ca
definition: Shallow containers designed to be used for urination or defecation by persons confined to bed. For containers found in a bed chamber, but not necessarily designed for use in the bed, prefer "chamber pots." For portable vessels for urine, prefer "urinals (containers)." @en
in scheme: Objetos
preferred label: Bedpan @en

Contenedores para el cuidado de la salud
type: Concept
narrower: Orinal
preferred label: Contenidors per a la cura de la salut @ca
preferred label: Containers for health care @en