Activities
type: ConceptScheme
preferred label: Actividades @es
preferred label: Activitats @ca

Countersinking
type: Concept
broader: Nailing
definition: Procedimiento que consiste en hacer un cajeado en el lugar en el que se insertan un clavo o un tornillo para meter la cabeza del mismo de manera que no sobresalga. @es
definition: Procediment que consistix a fer un encaixat en el lloc en el qual s'inserixen un clau o un caragol per a ficar el cap del mateix de manera que no sobreisca. @ca
definition: Procedure that consists of making a recess in the place where a nail or screw is inserted so that the head of the nail or screw does not protrude.
in scheme: Activities
narrower: Procesos y técnicas de formaci
preferred label: Aixamfranament @ca
preferred label: Avellanado @es

Procesos y técnicas de formaci
type: Concept
broader: Countersinking

Nailing
type: Concept
narrower: Countersinking
preferred label: Clavado @es
preferred label: Clavat @ca