Objetos
type: ConceptScheme
preferred label: Objectes @ca
preferred label: Objects @en

Librería vitrina
type: Concept
alternative label: biblioteca
alternative label: bookcase (bibliothèques) @en
broader: Librería
definition: Aparadores que contienen librerías. Su cuerpo inferior suele ser cerrado, en tanto que el superior, más alto, tiene puertas acristaladas, en general protegidas y adornadas por entramados de molduras aplicadas.
definition: Aparadors que contenen llibreries. El seu cos inferior sol ser tancat, en tant que el superior, més alt, té portes envidrades, en general protegides i adornades per entramats de motlures aplicades. @ca
definition: Sideboards containing bookcases. The lower body is usually closed, while the upper body, taller than the other one, has glazed doors, usually protected and decorated with applied mouldings. @en
in scheme: Objetos
preferred label: Llibreria vitrina @ca
preferred label: Bibliothèques @en

Librería
type: Concept
narrower: Librería vitrina
preferred label: Llibreria @ca
preferred label: Bookcase @en