Actividades
type: ConceptScheme
preferred label: Activitats @ca
preferred label: Activities @en

Tablero de fibra
type: Concept
broader: Aglomerado
definition: Tableros obtenidos a partir de maderas que han sido reducidas a sus elementos fibrosos básicos, luego reconstruidas con aglutinantes y finalmente prensadas. Las hay de diferentes densidades en función de los adhesivos y de la presión aplicada.
definition: Taulers obtinguts a partir de fustes que han estat reduïdes als seus elements fibrosos bàsics, després reconstruïdes amb aglutinants i finalment premsades. N'hi ha de diferents densitats en funció dels adhesius i de la pressió aplicada. @ca
definition: Boards made from wood that has been reduced into its basic fibrous elements, then rebuilt with binders and finally pressed. They are available in different densities depending on the adhesives and the pressure applied. @en
in scheme: Actividades
preferred label: Tauler de fibra @ca
preferred label: Fibreboard @en

Aglomerado
type: Concept
narrower: Tablero de fibra
preferred label: Aglomerat @ca
preferred label: Agglomeration @en