Objects
type: ConceptScheme
preferred label: Objetos @es
preferred label: Objectes @ca

Tools
type: Concept
broader: Toys by form
definition: Juguete que imita varios tipos de herramientas. @es
definition: Joguet que imita diversos tipus de ferramentes.
definition: Toy that imitates various types of tools.
in scheme: Objects
preferred label: Herramientas @es
preferred label: Ferramentes @ca

Toys by form
type: Concept
narrower: Tools
preferred label: Juguete por forma @es
preferred label: Joguet per forma @ca