Objetos
type: ConceptScheme
preferred label: Objectes @ca
preferred label: Objects @en

Juguete de arrastre
type: Concept
broader: Juguete para rodar
definition: Juguetes diseñados para ser tirados a lo largo del suelo.
definition: Joguet dissenyats per a ser tirats al llarg del sòl. @ca
definition: Toys designed to be pulled along the ground. @en
in scheme: Objetos
preferred label: Joguet d'arrossegament @ca
preferred label: Pull toy @en

Juguete para rodar
type: Concept
narrower: Juguete de arrastre
preferred label: Joguets per a rodar @ca
preferred label: Push-pull toy @en