Actividades
type: ConceptScheme
preferred label: Activitats @ca
preferred label: Activities @en

Entalladura
type: Concept
alternative label: Entallamant @ca
broader: Procesos y técnicas sobre madera
definition: Corte profundo realizado en la madera que se utiliza para ensamblar piezas o como filete.
definition: Tall profund realitzat en la fusta que s'utilitza per a assemblar peces o com a filet. @ca
definition: A deep cut into wood used to assemble pieces or as a fillet. @en
in scheme: Actividades
preferred label: Groove @en

Procesos y técnicas sobre madera
type: Concept
narrower: Entalladura
preferred label: Processos i tècniques sobre fusta @ca
preferred label: Processes and techniques for woodworking @en