Objetos
type: ConceptScheme
preferred label: Objectes @ca
preferred label: Objects @en

Salón
type: Concept
broader: Vivienda
definition: Del aum. de sala. En una casa, habitación principal en que se suele recibir a las visitas y que generalmente sirve de comedor y cuarto de estar.
definition: El fr. salon, i aquest, de lit. salone, augmentatiu de sala; potser a través del cast. salón, que és pres també del fr. En una casa, habitació principal en què se sol rebre a les visites i que generalment servix de menjador i sala d'estar. @ca
definition: In a house, the main room in which visitors are usually received and which generally serves as a dining room and living room. @en
in scheme: Objetos
preferred label: Saló @ca
preferred label: Living room @en

Vivienda
type: Concept
narrower: Salón