Actividades
type: ConceptScheme
preferred label: Activitats @ca
preferred label: Activities @en

Procesos y técnicas de tejido
type: Concept
broader: Procesos y técnicas por material
definition: Conjunto de técnicas empleadas en la confección de una materia flexible como prendas de vestir, alfombras, tapices, etc., basadas en el entrecruzamiento o entrelazado de fibras textiles. Las técnicas textiles se clasifican de acuerdo con el uso o no de un telar.
definition: Conjunt de tècniques emprades en la confecció d'una matèria flexible com a peces de vestir, catifes, tapissos, etc., basades en l'entrecreuament o entrellaçat de fibres tèxtils. Les tècniques tèxtils es classifiquen d'acord amb l'ús o no d'un teler. @ca
definition: It refers to the different techniques used in the manufacture of a fabric or textile such as clothing, rugs, tapestries, etc., which are based on the interlacing of textile fibers. Techniques could be divided into those which use a loom or not. @en
in scheme: Actividades
narrower: Tisaje
preferred label: Processos i tècniques de teixit @ca
preferred label: Weaving techniques and processes @en

Tisaje
type: Concept
broader: Procesos y técnicas de tejido
preferred label: Tissatge @ca
preferred label: Weaving @en

Procesos y técnicas por material
type: Concept
narrower: Procesos y técnicas de tejido
preferred label: Processos i tècniques per material @ca
preferred label: Processes and techniques by material @en