Objetos
type: ConceptScheme
preferred label: Objectes @ca
preferred label: Objects @en

Macetero
type: Concept
broader: Contenedores hortícolas
definition: Cualquiera de los varios tipos de recipientes en los cuales se cultivan plantas o se colocan para propósitos decorativos.
definition: jardinera de jardí. Qualsevol dels diversos tipus de recipients en els quals es cultiven plantes o es col·loquen per a propòsits decoratius. @ca
definition: n. from plaunter. Any of various containers in which plants are grown or placed for decorative purposes. @en
in scheme: Objetos
preferred label: Jardinera @ca
preferred label: Planter @en

Contenedores hortícolas
type: Concept
narrower: Macetero
preferred label: Contenidors hortícoles @ca
preferred label: horticultural containers @en