Actividades
type: ConceptScheme
preferred label: Activitats @ca
preferred label: Activities @en

Estucado
type: Concept
broader: Enlucido
definition: Proceso o técnica de aplicar estuco a una superficie para cubrirla o decorarla.
definition: Procés o tècnica d'aplicar estuc a una superfície per a cobrir-la o decorar-la. @ca
definition: Process or techinque of applying a surface with fine plaster, so as to cover or add ornament. @en
in scheme: Actividades
preferred label: Estucat @ca
preferred label: Stuccoing @en

Enlucido
type: Concept
narrower: Estucado
preferred label: Arrebossat @ca
preferred label: Plastering @en