Objetos
type: ConceptScheme
preferred label: Objectes @ca
preferred label: Objects @en

Sillería de coro
type: Concept
broader: Sillería
definition: Conjunto de asientos de estructura compartida, que se sitúan en el coro de una iglesia o catedral, a cuyo perímetro se acomodan, es decir, alineadas a lo largo de las paredes del coro de las catedrales o de las iglesias colegiales y abaciales, que dividen a los canónigos, monjes y monjas (estas últimas en los conventos) en dos grupos. Así, se dividen en dos coros (de ahí el nombre dado al propio espacio) para la práctica de la salmodia, para los momentos de canto o recitación alternada de los salmos y otros textos del oficio divino. Estos asientos tienen la característica de permitir dos posiciones: sentado o de pie (si el asiento está elevado), con apoyo en una "piedad".
definition: Conjunt de seients d'estructura compartida, que se situen en el cor d'una església o catedral, al perímetre de la qual s'acomoden, és a dir, alineades al llarg de les parets del cor de les catedrals o de les esglésies col·legials i abacials, que divideixen als canonges, monjos i monges (aquestes últimes en els convents) en dos grups. Així, es divideixen en dos cors (d'ací el nom donat al propi espai) per a la pràctica de la salmòdia, per als moments de cant o recitació alternada dels salms i altres textos de l'ofici diví. Aquests seients tenen la característica de permetre dues posicions: assegut o dempeus (si el seient està elevat), amb suport en una "pietat". @ca
in scheme: Objetos
preferred label: Cadirat de cor @ca
preferred label: Choir stalls @en

Sillería
type: Concept
narrower: Sillería de coro
preferred label: Cadirat @ca
preferred label: Set of chairs @en