Objetos
type: ConceptScheme
preferred label: Objectes @ca
preferred label: Objects @en

Vehículo de pedales
type: Concept
broader: Juguete para montar
definition: Juguetes parecidos a vehículos con pedales semejantes a las bicicletas; surgidos en forma simple a fines del siglo XIX y cerca de principios del siglo XX tenían a veces accesorios más elaborados parecidos a autos y componentes de funcionamiento reales.
definition: Joguets semblants a vehicles amb pedals semblants a les bicicletes; sorgits en forma simple a fins del segle XIX i prop de principis del segle XX tenien a vegades accessoris més elaborades semblances a actuacions i components de funcionament reals. @ca
definition: Vehiclelike toys with pedals akin to bicycles; appeared in simple form in the late 19th century and by the early 20th century sometimes had more eleborate carlike accessories and actual working components. @en
in scheme: Objetos
narrower: Triciclo
preferred label: Vehicle a pedals @ca
preferred label: Pedal cars @en

Triciclo
type: Concept
broader: Vehículo de pedales
preferred label: Tricicle @ca
preferred label: Tricycle @en

Juguete para montar
type: Concept
narrower: Vehículo de pedales
preferred label: Joguet per a montar-se @ca
preferred label: Riding toy @en