Actividades
type: ConceptScheme
preferred label: Activitats @ca
preferred label: Activities @en

Procesos y técnicas del papel
type: Concept
broader: Procesos y técnicas por material
definition: Conjunto de procedimientos empleados en la fabricación y acabado del papel, así como de objetos fabricados con esta materia
definition: Conjunt de procediments emprats en la fabricació i acabat del paper, així com d'objectes fabricats amb aquesta matèria @ca
definition: The set of processes used in the manufacture and finishing of paper, as well as of objects made from this material. @en
in scheme: Actividades
preferred label: Processos i tècniques de paper @ca
preferred label: Paper techniques and processes @en

Procesos y técnicas por material
type: Concept
narrower: Procesos y técnicas del papel
preferred label: Processos i tècniques per material @ca
preferred label: Processes and techniques by material @en