Objectes
type: ConceptScheme
preferred label: Objetos @es
preferred label: Objects @en

Làmpara de peu
type: Concept
alternative label: làmpada de peu
broader: Làmpada per forma
definition: Lámpara autoportante que descansa sobre uno o varios pies de longitud variable. Están diseñadas para apoyarse en el suelo. @es
definition: Làmpara autoportant que descansa sobre un o diversos peus de longitud variable. Estan dissenyades per a secundar-se en el sòl.
definition: Self-supporting lamp resting on one or more feet of variable length. They are designed to rest on the floor. @en
in scheme: Objectes
preferred label: Lámpara de pie @es
preferred label: Floor lamps @en

Làmpada per forma
type: Concept
narrower: Làmpara de peu
preferred label: Lámpara por forma @es
preferred label: Lamps by form @en