Objetos
type: ConceptScheme
preferred label: Objectes @ca
preferred label: Objects @en

Pala
type: Concept
alternative label: listón de respaldo
alternative label: splad @en
broader: Componentes de respaldo
definition: Del lat. pala. Pieza ancha central vertical en los respaldos de las sillas generalmente con forma o perforada. Los desarrollos típicos de los listones son importantes índices de estilo, como el listón con volutas de la Reina Ana, o los listones perforados de Chippendale. Esta pieza se encuentra sobre todo en las sillas a la inglesa.
definition: Del ll. pala, íd. Peça ampla central vertical en els respatlers de les cadires generalment amb forma o perforada. Els desenvolupaments típics dels llistons són importants índexs d'estil, com el llistó amb volutes de la Reina Ana, o els llistons perforats de Chippendale. Aquesta peça es troba sobretot en les cadires a l'anglesa. @ca
definition: n. related to Old English spl?tan. Flat central vertical member in a chair back, generally shaped or pierced. Typical developments of splats are important indices of style, such as Queen Anne scrolled splat, or the pierced splats of Chippendale. This piece is mainly found in English-style chairs. @en
in scheme: Objetos
preferred label: Splat @en

Componentes de respaldo
type: Concept
narrower: Pala
preferred label: Components del respatler @ca
preferred label: Back components @en