Objects
type: ConceptScheme
preferred label: Objetos @es
preferred label: Objectes @ca

Méridienne
type: Concept
broader: Chaises longues
definition: A méridienne has a high head-rest, and a lower foot-rest, joined by a sloping piece. Whether or not they have anything at the foot end, méridiennes are asymmetrical day-beds. They were popular in the grand houses of France in the early 19th century. Its name is from its typical use: rest in the middle of the day, when the sun is near the meridian
in scheme: Objects

Chaises longues
type: Concept
narrower: Méridienne
preferred label: Chaises longue @es
preferred label: Chaise longue @ca