Objetos
type: ConceptScheme
preferred label: Objectes @ca
preferred label: Objects @en

Juguete multiactividades
type: Concept
broader: Juguete instructivo
definition: Juguetes con diferentes formas compuestos por más de una actividad como elementos musicales, encaje de piezas... tienen como objetivo desarrollar la inteligencia y psicomotricidad. Suele ir orientados a niños o niñas de 0 a 3 años.
definition: Joguets amb diferents formes compostos per més d'una activitat com a elements musicals, encaix de peces... tenen com a objectiu desenvolupar la intel·ligència i psicomotricitat. Sol anar orientats a xiquets o xiquetes de 0 a 3 anys. @ca
definition: Toys with different shapes made up of more than one activity, such as musical elements, fitting pieces together... are aimed at developing intelligence and psychomotor skills. They are usually aimed at children from 0 to 3 years old. @en
in scheme: Objetos
preferred label: Joguet multiactivitats @ca
preferred label: Multi-activity toy @en

Juguete instructivo
type: Concept
narrower: Juguete multiactividades
preferred label: Joguet instructiu @ca
preferred label: Educational toy @en