Objetos
type: ConceptScheme
preferred label: Objectes @ca
preferred label: Objects @en

Teléfono
type: Concept
broader: Juguete por forma
definition: De tele-1 y ??fono. Objeto con forma de teléfono que puede ser de varios tipos.
definition: De tele- i -fon1 1a font: 1888, DLab. Objecte amb forma de telèfon que pot ser diferents tious. @ca
definition: Tele- + -phone: term adopted by Bell (1876) after use for other sound instruments. A telephone-shaped object that can be of various types. @en
in scheme: Objetos
preferred label: Telèfon @ca
preferred label: Telephone @en

Juguete por forma
type: Concept
narrower: Teléfono
preferred label: Joguet per forma @ca
preferred label: Toys by form @en